EnrollmentID,hhid,n_hhmem,n_chronic,n_vet,oldest_id,oldest_age,hh_shelter_type,n_und18,n_1824,n_25p,hh_entrydt,chronicHH,vetHH,any_kids,any_child,hhold_type,youthHH,ProgramName,OrgName,LAUID,physical_yn,physical_dur,physical,mental_yn,mental_dur,mental,develop,develop_dur,chronHealth,chronHealth_dur,hiv,hiv_dur,domViol,flee_viol,flee_dv_hmls,domviol_when,dv_status,subsAbuse_dur,alcohol_yn,drugs_yn,subsAbuse_type,subsAbuse,chronCond,sexorient,education,school,employment,emp_type,emp_whynot,emp_stat_hmis,veteran,vet_1940_1947,vet_1950_1955,vet_1964_1975,vet_1991_2001,vet_Afghanistan,vet_IraqFreedom,vet_IraqDawn,vet_other,vet_2001_2018,vetdischarge,foster_care,censustract,exitdt,DOB,age_mos,age_yrs,age_cat,relation_hmis,rawDisabled,gender_nofa,hispanic,race_nofa,prior_hmls,priorliving,destination,lengthstay,hmls_past1yr_times,hmls_past3yr_times,hmls_past3yr_months,entrydt,since_entry_mo,hmls_start_dt,since_hmls_mo,chronlive,chronicP,from_street,dupct,dec2018_sheltered,multi_tractHH,keep_dup,in_dedup,in_enroll,anydup,chronicP_D,oldestP,tract,CoC,age_catd,age_2554,age_5561,age_62p,male,female,transgender,nonconforming,straight,gay,bisexual,nc_sexorient,nonhispanic,white,black,asian,ai_an,nh_pi,multirace,NH_white,NH_black,NH_asian,NH_ai_an,NH_nh_pi,NH_multirace,screen_type,income_other_source,benefits_other_source,benefit_snap_yn,benefits_medicaid_yn,benefits_medicare_yn,benefits_noncash_yn,benefits_other_yn,benefits_schip_yn,benefits_section8_yn,benefits_tanf_childcare_yn,benefits_tanf_other_yn,benefits_tanf_transportation_yn,benefits_temp_rent_yn,benefits_va_medical_yn,benefits_wic_yn,health_ins_cobra_yn,health_ins_emp_yn,health_ins_ppay_yn,health_ins_state_yn,health_insurance_yn,income_cash_is_yn,income_earned_is_yn,income_unemployment_is_yn,income_ssi_is_yn,income_ssdi_is_yn,income_vet_disability_is_yn,income_private_disability_is_yn,income_workers_comp_is_yn,income_tanf_is_yn,income_ga_is_yn,income_spousal_support_is_yn,income_childsupport_is_yn,income_ss_retirement_is_yn,income_vet_pension_is_yn,income_private_pension_is_yn,income_other_is_yn,income_earned,income_unemployment,income_ssi,income_ssdi,income_vet_disability,income_private_disability,income_workers_comp,income_tanf,income_ga,income_spousal_support,income_childsupport,income_ss_retirement,income_vet_pension,income_private_pension,income_other,income_individual,SPA,SD,CD,SSD,AD,USCD,City_Type,city_name,Community,wt_spa,hs_spa,city,FamilyType,age_und18,age_1824,age_ov24,age_catb
525365,520060,1,0,0,525365,59,1,0,0,1,06/08/18,,0,0,0,2,0,DHS Recuperative Care Lake View Terrance,"Serenity Recuperative Care, Inc.",2968,1,0,0,0,V,0,0,V,1,0,0,V,0,0,0,V,0,N,0,0,0,0,1,C,N,N,0,N,3,7,0,N,N,N,N,N,N,N,N,N,,0,104124,M,08/19/1959,712,59,3,1,N,1,0,1,1,1,0,6,4,4,13,06/08/18,7,06/08/2017,19,3,1,N,0,1,0,1,1,1,0,N,1,104124,1,5,0,1,0,1,0,0,0,,,,,1,1,0,0,0,0,0,1,0,0,0,0,0,2,NULL,NULL,N,1,0,0,N,0,N,N,N,N,N,0,N,0,0,0,0,1,0,N,N,N,N,N,N,N,N,N,N,N,N,N,N,N,M,M,M,M,M,M,M,M,M,M,M,M,M,M,M,M,2,3,7,25,39,28,1,Los Angeles,Angeles National Forest,2,,1,4,0,0,1,4
525384,520090,1,0,0,525384,47,1,0,0,1,06/20/18,,0,0,0,2,0,DHS Recuperative Care Lake View Terrance,"Serenity Recuperative Care, Inc.",2968,0,V,0,1,1,1,0,V,0,V,0,V,1,0,0,3,1,N,0,0,0,0,1,C,N,N,0,N,1,5,0,N,N,N,N,N,N,N,N,N,,0,104124,01/25/2019,02/18/1971,574,47,3,1,1,2,0,2,0,13,6,5,C,C,C,06/20/18,7,06/20/2017,19,X,X,N,0,1,0,1,1,1,0,X,1,104124,1,4,1,0,0,0,1,0,0,,,,,1,0,1,0,0,0,0,0,1,0,0,0,0,2,NULL,NULL,N,1,0,0,N,0,N,N,N,N,N,0,N,0,0,0,0,1,1,0,0,0,1,0,0,0,0,0,0,0,0,0,0,0,M,M,M,1001,M,M,M,M,M,M,M,M,M,M,M,1001,2,3,7,25,39,28,1,Los Angeles,Angeles National Forest,2,,1,4,0,0,1,3
525394,520099,1,0,0,525394,32,1,0,0,1,06/15/18,0,0,0,0,2,0,DHS Recuperative Care Lake View Terrance,"Serenity Recuperative Care, Inc.",2968,0,V,0,1,0,0,0,V,0,V,0,V,0,0,0,V,0,N,0,0,0,0,0,C,N,N,0,N,2,6,0,N,N,N,N,N,N,N,N,N,,C,104124,M,01/16/1986,395,32,3,1,0,2,0,2,0,13,0,6,C,C,C,06/15/18,7,06/15/2017,19,X,0,N,0,1,0,1,1,1,0,0,1,104124,1,4,1,0,0,0,1,0,0,,,,,1,0,1,0,0,0,0,0,1,0,0,0,0,2,NULL,NULL,N,1,0,0,N,0,N,N,N,N,N,0,N,0,0,0,0,1,1,0,0,0,0,0,0,0,0,1,0,0,0,0,0,0,M,M,M,M,M,M,M,M,220,M,M,M,M,M,M,220,2,3,7,25,39,28,1,Los Angeles,Angeles National Forest,2,,1,4,0,0,1,3
525406,520115,1,0,0,525406,56,1,0,0,1,09/04/18,0,0,0,0,2,0,DHS Recuperative Care Lake View Terrance,"Serenity Recuperative Care, Inc.",2968,1,0,0,0,V,0,0,V,0,V,0,V,0,0,0,V,0,N,0,0,0,0,0,C,N,N,0,N,3,7,0,N,N,N,N,N,N,N,N,N,,0,104124,M,07/15/1962,677,56,3,1,0,1,1,C,1,1,0,C,4,4,13,09/04/18,4,09/04/2017,16,3,0,N,0,1,0,1,1,1,0,0,1,104124,1,5,0,1,0,1,0,0,0,,,,,0,,,,,,,,,,,,,2,NULL,NULL,N,1,0,0,N,0,N,N,N,N,N,0,N,0,0,0,0,1,0,N,N,N,N,N,N,N,N,N,N,N,N,N,N,N,M,M,M,M,M,M,M,M,M,M,M,M,M,M,M,M,2,3,7,25,39,28,1,Los Angeles,Angeles National Forest,2,,1,4,0,0,1,4
519200,514296,1,0,0,519200,29,1,0,0,1,12/15/18,0,0,0,0,2,0,Winter Shelter Program Pacoima SPA 2,Hope of the Valley Rescue Mission,1444,0,V,0,0,V,0,0,V,0,V,0,V,0,0,0,V,0,N,0,0,0,0,0,1,N,N,0,N,1,5,0,N,N,N,N,N,N,N,N,N,,1,104320,M,07/18/1989,353,29,3,1,0,1,1,1,1,1,0,4,2,3,3,12/15/18,1,11/12/2018,2,0,0,N,0,1,0,1,1,1,0,0,1,104320,1,4,1,0,0,1,0,0,0,1,0,0,0,0,1,0,0,0,0,0,,,,,,,2,NULL,NULL,1,1,0,1,0,0,N,0,0,0,N,0,0,0,0,0,0,1,1,0,0,0,0,0,0,0,0,1,0,0,0,0,0,0,M,M,M,M,M,M,M,M,221,M,M,M,M,M,M,221,2,3,7,18,39,29,1,Los Angeles,Pacoima,2,,1,4,0,0,1,3
521715,516214,1,1,0,521715,61,1,0,0,1,12/19/18,1,,0,0,2,0,Winter Shelter Program Pacoima SPA 2,Hope of the Valley Rescue Mission,1444,1,1,1,0,V,0,0,V,1,1,0,V,0,0,0,V,0,N,0,0,0,0,1,1,N,N,0,N,3,7,C,C,C,C,C,C,C,C,C,C,Not collected,0,104320,M,08/11/1957,736,61,3,1,1,1,0,2,1,1,0,2,1,4,13,12/19/18,1,02/19/2000,227,3,1,N,0,1,0,1,1,1,0,1,1,104320,1,5,0,1,0,1,0,0,0,1,0,0,0,1,0,1,0,0,0,0,0,1,0,0,0,0,2,NULL,NULL,1,1,0,1,0,0,N,0,0,0,N,0,0,0,0,0,0,1,1,0,0,0,0,0,0,0,0,1,0,0,0,0,0,0,M,M,M,M,M,M,M,M,221,M,M,M,M,M,M,221,2,3,7,18,39,29,1,Los Angeles,Pacoima,2,,1,4,0,0,1,4
521124,515688,1,1,0,521124,65,1,0,0,1,12/18/18,1,0,0,0,2,0,Winter Shelter Program Pacoima SPA 2,Hope of the Valley Rescue Mission,1444,1,1,1,1,1,1,0,V,1,1,0,V,0,0,0,V,0,N,0,0,0,0,1,4,N,N,0,N,3,7,0,N,N,N,N,N,N,N,N,N,,0,104320,M,12/10/1953,780,65,3,1,1,1,0,1,1,1,0,6,1,4,13,12/18/18,1,01/01/2014,60,3,1,N,0,1,0,1,1,1,0,1,1,104320,1,6,0,0,1,1,0,0,0,0,0,0,1,1,1,0,0,0,0,0,1,0,0,0,0,0,2,NULL,NULL,1,1,0,1,0,0,N,0,0,0,N,0,0,0,0,0,0,1,1,0,0,1,0,0,0,0,0,0,0,0,0,0,0,0,M,M,900,M,M,M,M,M,M,M,M,M,M,M,M,900,2,3,7,18,39,29,1,Los Angeles,Pacoima,2,,1,4,0,0,1,5
520216,514968,1,0,0,520216,43,1,0,0,1,12/17/18,0,0,0,0,2,0,Winter Shelter Program Pacoima SPA 2,Hope of the Valley Rescue Mission,1444,0,V,0,0,V,0,0,V,0,V,0,V,0,0,0,V,0,0,0,0,3,0,0,1,N,N,0,N,1,5,0,N,N,N,N,N,N,N,N,N,,0,104320,M,01/03/1975,527,43,3,1,0,1,1,1,1,1,0,2,4,4,13,12/17/18,1,12/01/2010,97,3,0,N,0,1,0,1,1,1,0,0,1,104320,1,4,1,0,0,1,0,0,0,1,0,0,0,0,1,0,0,0,0,0,,,,,,,2,NULL,NULL,1,1,0,1,0,0,N,0,0,0,N,0,0,0,0,0,0,1,1,0,0,0,0,0,0,0,0,1,0,0,0,0,0,0,M,M,M,M,M,M,M,M,76,M,M,M,M,M,M,76,2,3,7,18,39,29,1,Los Angeles,Pacoima,2,,1,4,0,0,1,3
525227,519927,1,0,0,525227,50,1,0,0,1,12/31/18,0,0,0,0,2,0,Winter Shelter Program Pacoima SPA 2,Hope of the Valley Rescue Mission,1444,0,V,0,0,V,0,0,V,0,V,0,V,0,0,0,V,0,N,0,0,0,0,0,1,N,N,0,N,1,5,0,N,N,N,N,N,N,N,N,N,,1,104320,M,01/04/1968,611,50,3,1,0,1,0,1,1,1,0,4,2,4,13,12/31/18,1,02/17/2017,23,3,0,N,0,1,0,1,1,1,0,0,1,104320,1,4,1,0,0,1,0,0,0,1,0,0,0,1,1,0,0,0,0,0,1,0,0,0,0,0,2,NULL,NULL,1,1,0,1,0,0,N,0,0,0,N,0,0,0,0,0,0,1,1,0,0,0,0,0,0,0,0,1,0,0,0,0,0,0,M,M,M,M,M,M,M,M,221,M,M,M,M,M,M,221,2,3,7,18,39,29,1,Los Angeles,Pacoima,2,,1,4,0,0,1,3
518810,514033,1,0,0,518810,33,1,0,0,1,12/14/18,0,0,0,0,2,0,Winter Shelter Program Pacoima SPA 2,Hope of the Valley Rescue Mission,1444,0,V,0,1,1,1,0,V,0,V,0,V,0,0,0,V,0,N,0,0,0,0,1,1,N,N,0,N,3,7,0,C,C,C,C,C,C,C,C,C,Not collected,1,104320,M,03/15/1985,405,33,3,1,1,1,1,1,1,1,0,4,2,2,3,12/14/18,1,10/01/2018,3,0,0,N,0,1,0,1,1,1,0,0,1,104320,1,4,1,0,0,1,0,0,0,1,0,0,0,0,1,0,0,0,0,0,,,,,,,2,NULL,NULL,1,1,0,1,0,0,N,0,0,0,N,0,0,0,0,0,0,1,1,0,0,0,0,0,0,0,0,1,0,0,0,0,0,0,M,M,M,M,M,M,M,M,221,M,M,M,M,M,M,221,2,3,7,18,39,29,1,Los Angeles,Pacoima,2,,1,4,0,0,1,3
521718,516219,1,1,0,521718,45,1,0,0,1,12/19/18,1,0,0,0,2,0,Winter Shelter Program Pacoima SPA 2,Hope of the Valley Rescue Mission,1444,1,1,1,1,1,1,1,1,1,1,0,V,0,0,0,V,0,1,0,1,2,1,1,1,N,N,0,N,1,5,0,C,C,C,C,C,C,C,C,C,Not collected,C,104320,M,07/18/1973,545,45,3,1,1,1,1,1,1,1,0,2,4,4,13,12/19/18,1,01/01/2014,60,3,1,N,0,1,0,1,1,1,0,1,1,104320,1,4,1,0,0,1,0,0,0,1,0,0,0,0,1,0,0,0,0,0,,,,,,,2,NULL,NULL,N,1,0,0,N,0,N,N,N,N,N,0,N,0,0,0,0,1,0,N,N,N,N,N,N,N,N,N,N,N,N,N,N,N,M,M,M,M,M,M,M,M,M,M,M,M,M,M,M,M,2,3,7,18,39,29,1,Los Angeles,Pacoima,2,,1,4,0,0,1,3
522860,517342,1,1,0,522860,62,1,0,0,1,12/22/18,1,0,0,0,2,0,Winter Shelter Program Pacoima SPA 2,Hope of the Valley Rescue Mission,1444,0,V,0,0,V,0,0,V,0,V,0,V,0,0,0,V,0,1,1,0,1,1,1,1,N,N,0,N,1,5,0,C,C,C,C,C,C,C,C,C,Not collected,0,104320,M,12/23/1956,744,62,3,1,1,1,1,1,1,1,0,6,1,1,13,12/22/18,1,03/03/2013,70,2,1,N,0,1,0,1,1,1,0,1,1,104320,1,6,0,0,1,1,0,0,0,1,0,0,0,0,1,0,0,0,0,0,,,,,,,2,NULL,NULL,N,N,N,0,N,N,N,N,N,N,N,N,N,N,N,N,N,0,0,N,N,N,N,N,N,N,N,N,N,N,N,N,N,N,M,M,M,M,M,M,M,M,M,M,M,M,M,M,M,M,2,3,7,18,39,29,1,Los Angeles,Pacoima,2,,1,4,0,0,1,5
519179,514271,1,0,0,519179,59,1,0,0,1,12/15/18,0,0,0,0,2,0,Winter Shelter Program Pacoima SPA 2,Hope of the Valley Rescue Mission,1444,1,0,0,0,V,0,0,V,0,V,0,V,1,0,0,4,1,N,0,0,0,0,0,1,N,N,0,N,3,7,0,C,C,C,C,C,C,C,C,C,Not collected,0,104320,M,10/04/1959,710,59,3,1,0,2,0,1,1,1,0,5,4,4,13,12/15/18,1,02/01/2013,71,3,0,N,0,1,0,1,1,1,0,0,1,104320,1,5,0,1,0,0,1,0,0,1,0,0,0,1,1,0,0,0,0,0,1,0,0,0,0,0,2,NULL,NULL,N,1,1,0,N,0,N,N,N,N,N,0,N,0,0,0,0,1,1,0,0,1,0,0,0,0,0,0,0,0,0,0,0,0,M,M,500,M,M,M,M,M,M,M,M,M,M,M,M,500,2,3,7,18,39,29,1,Los Angeles,Pacoima,2,,1,4,0,0,1,4
522689,517183,1,0,0,522689,38,1,0,0,1,12/21/18,0,0,0,0,2,0,Winter Shelter Program Pacoima SPA 2,Hope of the Valley Rescue Mission,1444,0,V,0,0,V,0,0,V,0,V,0,V,0,0,0,V,0,N,0,0,0,0,0,1,N,N,0,N,1,5,0,N,N,N,N,N,N,N,N,N,,0,104320,M,12/09/1980,456,38,3,1,0,1,0,2,1,1,0,3,1,1,1,12/21/18,1,12/01/2018,1,0,0,N,0,1,0,1,1,1,0,0,1,104320,1,4,1,0,0,1,0,0,0,1,0,0,0,1,0,1,0,0,0,0,0,1,0,0,0,0,2,NULL,NULL,N,N,N,0,N,N,N,N,N,N,N,N,N,N,N,N,N,0,0,N,N,N,N,N,N,N,N,N,N,N,N,N,N,N,M,M,M,M,M,M,M,M,M,M,M,M,M,M,M,M,2,3,7,18,39,29,1,Los Angeles,Pacoima,2,,1,4,0,0,1,3
524888,519576,1,1,0,524888,26,1,0,0,1,12/30/18,1,0,0,0,2,0,Winter Shelter Program Pacoima SPA 2,Hope of the Valley Rescue Mission,1444,0,V,0,0,V,0,1,1,0,V,0,V,1,0,0,D,1,N,0,0,0,0,1,1,N,N,0,N,2,6,0,N,N,N,N,N,N,N,N,N,,1,104320,M,05/07/1992,319,26,3,1,1,2,0,2,0,11,0,1,1,4,13,12/30/18,1,12/30/2016,25,3,1,N,0,1,0,1,1,1,0,1,1,104320,1,4,1,0,0,0,1,0,0,1,0,0,0,1,0,1,0,0,0,0,0,1,0,0,0,0,2,NULL,NULL,1,1,0,1,0,0,N,0,0,0,N,0,0,0,0,0,0,1,1,0,0,0,0,0,0,0,0,1,0,0,0,0,0,0,M,M,M,M,M,M,M,M,221,M,M,M,M,M,M,221,2,3,7,18,39,29,1,Los Angeles,Pacoima,2,,1,4,0,0,1,3
523652,518355,1,0,0,523652,39,1,0,0,1,12/26/18,0,0,0,0,2,0,Winter Shelter Program Pacoima SPA 2,Hope of the Valley Rescue Mission,1444,1,1,1,0,V,0,0,V,0,V,0,V,0,0,0,V,0,1,1,0,1,1,1,1,N,N,0,N,2,6,0,C,C,C,C,C,C,C,C,C,Not collected,0,104320,M,05/09/1979,475,39,3,1,1,1,1,1,0,21,0,1,4,1,3,12/26/18,1,09/28/2018,4,0,0,N,0,1,0,1,1,1,0,0,1,104320,1,4,1,0,0,1,0,0,0,1,0,0,0,0,1,0,0,0,0,0,,,,,,,2,NULL,NULL,N,1,0,0,N,0,N,N,N,N,N,0,N,0,0,0,0,1,0,N,N,N,N,N,N,N,N,N,N,N,N,N,N,N,M,M,M,M,M,M,M,M,M,M,M,M,M,M,M,M,2,3,7,18,39,29,1,Los Angeles,Pacoima,2,,1,4,0,0,1,3
524194,518893,1,0,0,524194,47,1,0,0,1,12/27/18,0,0,0,0,2,0,Winter Shelter Program Pacoima SPA 2,Hope of the Valley Rescue Mission,1444,0,V,0,0,V,0,0,V,1,1,0,V,0,0,0,V,0,N,0,0,0,0,1,1,N,N,0,N,1,5,0,N,N,N,N,N,N,N,N,N,,0,104320,M,08/27/1971,568,47,3,1,1,1,0,2,0,13,0,2,1,1,13,12/27/18,1,12/27/2014,49,0,0,N,0,1,0,1,1,1,0,0,1,104320,1,4,1,0,0,1,0,0,0,1,0,0,0,1,0,1,0,0,0,0,0,1,0,0,0,0,2,NULL,NULL,N,1,0,0,N,0,N,N,N,N,N,0,N,0,0,0,0,1,0,N,N,N,N,N,N,N,N,N,N,N,N,N,N,N,M,M,M,M,M,M,M,M,M,M,M,M,M,M,M,M,2,3,7,18,39,29,1,Los Angeles,Pacoima,2,,1,4,0,0,1,3
523623,518328,1,0,0,523623,44,1,0,0,1,12/26/18,0,0,0,0,2,0,Winter Shelter Program Pacoima SPA 2,Hope of the Valley Rescue Mission,1444,0,V,0,0,V,0,0,V,0,V,0,V,0,0,0,V,0,N,0,0,0,0,0,1,N,N,1,1,N,1,0,N,N,N,N,N,N,N,N,N,,C,104320,M,12/30/1974,528,44,3,1,0,1,0,1,1,1,0,5,2,1,12,12/26/18,1,11/13/2015,38,0,0,N,0,1,0,1,1,1,0,0,1,104320,1,4,1,0,0,1,0,0,0,1,0,0,0,1,1,0,0,0,0,0,1,0,0,0,0,0,2,NULL,NULL,N,1,0,0,N,0,N,N,N,N,N,0,N,0,0,0,0,1,1,1,0,0,0,0,0,0,0,0,0,0,0,0,0,0,1300,M,M,M,M,M,M,M,M,M,M,M,M,M,M,1300,2,3,7,18,39,29,1,Los Angeles,Pacoima,2,,1,4,0,0,1,3
524707,519384,1,1,0,524707,53,1,0,0,1,12/28/18,1,0,0,0,2,0,Winter Shelter Program Pacoima SPA 2,Hope of the Valley Rescue Mission,1444,0,V,0,0,V,0,1,1,1,1,0,V,0,0,0,V,0,1,0,1,2,1,1,1,N,N,0,N,1,5,0,N,N,N,N,N,N,N,N,N,,0,104320,M,06/17/1965,642,53,3,1,1,2,1,1,1,1,0,6,2,2,13,12/28/18,1,12/01/2017,13,2,1,N,0,1,0,1,1,1,0,1,1,104320,1,4,1,0,0,0,1,0,0,1,0,0,0,0,1,0,0,0,0,0,,,,,,,2,NULL,NULL,N,N,N,0,N,N,N,N,N,N,N,N,N,N,N,N,N,0,0,N,N,N,N,N,N,N,N,N,N,N,N,N,N,N,M,M,M,M,M,M,M,M,M,M,M,M,M,M,M,M,2,3,7,18,39,29,1,Los Angeles,Pacoima,2,,1,4,0,0,1,3
523637,518342,1,0,0,523637,59,1,0,0,1,12/26/18,0,0,0,0,2,0,Winter Shelter Program Pacoima SPA 2,Hope of the Valley Rescue Mission,1444,0,V,0,0,V,0,0,V,1,0,0,V,0,0,0,V,0,0,1,0,1,0,1,1,N,N,0,N,3,7,0,N,N,N,N,N,N,N,N,N,,0,104320,M,09/02/1959,711,59,3,1,0,1,1,4,1,1,0,2,1,1,13,12/26/18,1,07/26/2016,30,0,0,N,0,1,0,1,1,1,0,0,1,104320,1,5,0,1,0,1,0,0,0,1,0,0,0,0,0,0,0,1,0,0,,,,,,,2,NULL,NULL,1,1,1,1,0,0,N,0,0,0,N,0,0,0,0,0,0,1,1,0,0,0,1,0,0,0,0,0,0,0,0,0,0,0,M,M,M,1030,M,M,M,M,M,M,M,M,M,M,M,1030,2,3,7,18,39,29,1,Los Angeles,Pacoima,2,,1,4,0,0,1,4
518896,514121,1,0,0,518896,54,1,0,0,1,12/14/18,0,0,0,0,2,0,Winter Shelter Program Pacoima SPA 2,Hope of the Valley Rescue Mission,1444,0,V,0,0,V,0,0,V,0,V,0,V,0,0,0,V,0,N,0,0,0,0,0,1,N,N,0,N,1,5,0,N,N,N,N,N,N,N,N,N,,0,104320,M,01/21/1964,659,54,3,1,0,1,0,2,1,1,0,6,4,4,13,12/14/18,1,01/01/2012,84,3,0,N,0,1,0,1,1,1,0,0,1,104320,1,4,1,0,0,1,0,0,0,1,0,0,0,1,0,1,0,0,0,0,0,1,0,0,0,0,2,NULL,NULL,N,N,N,0,N,N,N,N,N,N,N,N,N,N,N,N,N,0,0,N,N,N,N,N,N,N,N,N,N,N,N,N,N,N,M,M,M,M,M,M,M,M,M,M,M,M,M,M,M,M,2,3,7,18,39,29,1,Los Angeles,Pacoima,2,,1,4,0,0,1,3
521079,515639,1,0,0,521079,81,1,0,0,1,12/18/18,0,0,0,0,2,0,Winter Shelter Program Pacoima SPA 2,Hope of the Valley Rescue Mission,1444,0,V,0,0,V,0,0,V,1,1,0,V,0,0,0,V,0,N,0,0,0,0,1,1,N,N,0,N,2,6,0,N,N,N,N,N,N,N,N,N,,0,104320,M,12/20/1937,972,81,3,1,1,1,0,1,3,3,0,5,1,1,1,12/18/18,1,12/15/2018,1,0,0,N,0,1,0,1,1,1,0,0,1,104320,1,6,0,0,1,1,0,0,0,1,0,0,0,1,1,0,0,0,0,0,1,0,0,0,0,0,2,NULL,NULL,N,1,1,0,N,0,N,N,N,N,N,0,N,0,0,0,0,1,1,0,0,1,0,0,0,0,0,0,0,0,0,0,0,0,M,M,850,M,M,M,M,M,M,M,M,M,M,M,M,850,2,3,7,18,39,29,1,Los Angeles,Pacoima,2,,1,4,0,0,1,5
518864,514090,1,0,0,518864,41,1,0,0,1,12/14/18,0,0,0,0,2,0,Winter Shelter Program Pacoima SPA 2,Hope of the Valley Rescue Mission,1444,0,V,0,1,1,1,1,0,1,1,0,V,0,0,0,V,0,N,0,0,0,0,1,1,N,N,0,N,1,5,0,N,N,N,N,N,N,N,N,N,,0,104320,M,09/25/1977,495,41,3,1,1,1,0,1,1,1,0,4,1,1,2,12/14/18,1,11/02/2018,2,0,0,N,0,1,0,1,1,1,0,0,1,104320,1,4,1,0,0,1,0,0,0,1,0,0,0,1,1,0,0,0,0,0,1,0,0,0,0,0,2,NULL,NULL,1,1,0,1,0,0,N,0,0,0,N,0,0,0,0,0,0,1,1,0,0,0,0,0,0,0,0,1,0,0,0,0,0,0,M,M,M,M,M,M,M,M,221,M,M,M,M,M,M,221,2,3,7,18,39,29,1,Los Angeles,Pacoima,2,,1,4,0,0,1,3
521713,516215,1,0,0,521713,23,1,0,1,0,12/19/18,0,0,0,0,2,1,Winter Shelter Program Pacoima SPA 2,Hope of the Valley Rescue Mission,1444,0,V,0,0,V,0,0,V,0,V,0,V,0,0,0,V,0,N,0,0,0,0,0,1,N,N,0,N,1,5,0,N,N,N,N,N,N,N,N,N,,0,104320,M,04/26/1995,284,23,2,1,0,1,1,1,1,1,0,1,2,2,9,12/19/18,1,12/19/2016,25,0,0,N,0,1,0,1,1,1,0,0,1,104320,1,3,,,,1,0,0,0,1,0,0,0,0,1,0,0,0,0,0,,,,,,,2,NULL,NULL,N,N,N,0,N,N,N,N,N,N,N,N,N,N,N,N,N,0,0,N,N,N,N,N,N,N,N,N,N,N,N,N,N,N,M,M,M,M,M,M,M,M,M,M,M,M,M,M,M,M,2,3,7,18,39,29,1,Los Angeles,Pacoima,2,,1,4,0,1,0,2
524708,519386,1,1,0,524708,45,1,0,0,1,12/28/18,1,0,0,0,2,0,Winter Shelter Program Pacoima SPA 2,Hope of the Valley Rescue Mission,1444,0,V,0,1,1,1,0,V,0,V,0,V,1,0,0,4,1,N,0,0,0,0,1,1,N,N,0,N,1,5,0,N,N,N,N,N,N,N,N,N,,0,104320,M,09/26/1973,543,45,3,1,1,1,0,1,1,1,0,6,2,3,13,12/28/18,1,11/01/2016,26,2,1,N,0,1,0,1,1,1,0,1,1,104320,1,4,1,0,0,1,0,0,0,1,0,0,0,1,1,0,0,0,0,0,1,0,0,0,0,0,2,NULL,NULL,1,1,0,1,0,0,N,0,0,0,N,0,0,0,0,0,0,1,0,N,N,N,N,N,N,N,N,N,N,N,N,N,N,N,M,M,M,M,M,M,M,M,M,M,M,M,M,M,M,M,2,3,7,18,39,29,1,Los Angeles,Pacoima,2,,1,4,0,0,1,3
542348,537791,1,0,0,542348,51,1,0,0,1,12/12/18,0,0,0,0,2,0,Winter Shelter Program Pacoima SPA 2,Hope of the Valley Rescue Mission,1444,0,V,0,0,V,0,0,V,0,V,0,V,0,0,0,V,0,N,0,0,0,0,0,1,N,N,1,3,N,3,0,N,N,N,N,N,N,N,N,N,,C,104320,M,11/06/1967,613,51,3,1,0,1,1,1,2,2,0,D,1,1,13,12/12/18,1,10/09/2017,15,6,0,N,0,1,0,1,1,1,0,0,1,104320,1,4,1,0,0,1,0,0,0,1,0,0,0,0,1,0,0,0,0,0,,,,,,,2,NULL,NULL,N,1,1,0,N,0,N,N,N,N,N,0,N,0,0,0,0,1,1,1,0,0,0,0,0,0,0,0,0,0,0,0,0,0,3200,M,M,M,M,M,M,M,M,M,M,M,M,M,M,3200,2,3,7,18,39,29,1,Los Angeles,Pacoima,2,,1,4,0,0,1,3
521130,515694,1,0,0,521130,38,1,0,0,1,12/18/18,0,0,0,0,2,0,Winter Shelter Program Pacoima SPA 2,Hope of the Valley Rescue Mission,1444,0,V,0,1,D,Y,0,V,0,V,0,V,1,0,0,1,1,0,0,0,3,0,0,1,N,N,0,N,2,6,0,N,N,N,N,N,N,N,N,N,,0,104320,M,03/03/1980,465,38,3,1,0,1,1,C,0,9,0,2,4,1,3,12/18/18,1,09/18/2018,4,0,0,N,0,1,0,1,1,1,0,0,1,104320,1,4,1,0,0,1,0,0,0,1,0,0,0,0,,,,,,,,,,,,,2,NULL,NULL,1,1,0,1,0,0,N,0,0,0,N,0,0,0,0,0,0,1,1,0,0,0,0,0,0,0,0,1,0,0,0,0,0,0,M,M,M,M,M,M,M,M,221,M,M,M,M,M,M,221,2,3,7,18,39,29,1,Los Angeles,Pacoima,2,,1,4,0,0,1,3
521115,515678,1,0,0,521115,60,1,0,0,1,12/18/18,0,0,0,0,2,0,Winter Shelter Program Pacoima SPA 2,Hope of the Valley Rescue Mission,1444,1,1,1,0,V,0,0,V,1,1,0,V,0,0,0,V,0,1,1,0,1,1,1,1,N,N,0,N,3,7,0,N,N,N,N,N,N,N,N,N,,0,104320,M,03/16/1958,729,60,3,1,1,1,0,1,0,9,0,4,1,1,12,12/18/18,1,12/18/2017,13,0,0,N,0,1,0,1,1,1,0,0,1,104320,1,5,0,1,0,1,0,0,0,1,0,0,0,1,1,0,0,0,0,0,1,0,0,0,0,0,2,NULL,NULL,1,1,0,1,0,0,N,0,0,0,N,0,0,0,0,0,0,1,1,0,0,0,0,0,0,0,0,1,0,0,0,0,0,0,M,M,M,M,M,M,M,M,600,M,M,M,M,M,M,600,2,3,7,18,39,29,1,Los Angeles,Pacoima,2,,1,4,0,0,1,4
522701,517196,1,0,0,522701,34,1,0,0,1,12/21/18,0,0,0,0,2,0,Winter Shelter Program Pacoima SPA 2,Hope of the Valley Rescue Mission,1444,0,V,0,1,0,0,0,V,0,V,0,V,1,0,0,4,1,N,0,0,0,0,0,1,N,N,0,N,1,5,0,C,C,C,C,C,C,C,C,C,Not collected,0,104320,M,12/31/1984,408,34,3,1,0,1,1,2,1,1,0,3,2,3,13,12/21/18,1,12/21/2016,25,0,0,N,0,1,0,1,1,1,0,0,1,104320,1,4,1,0,0,1,0,0,0,1,0,0,0,0,0,1,0,0,0,0,,,,,,,2,NULL,NULL,1,1,0,1,0,0,N,0,0,0,N,0,0,0,0,0,0,1,0,N,N,N,N,N,N,N,N,N,N,N,N,N,N,N,M,M,M,M,M,M,M,M,M,M,M,M,M,M,M,M,2,3,7,18,39,29,1,Los Angeles,Pacoima,2,,1,4,0,0,1,3
521701,516201,1,0,0,521701,61,1,0,0,1,12/19/18,0,,0,0,2,0,Winter Shelter Program Pacoima SPA 2,Hope of the Valley Rescue Mission,1444,0,V,0,0,V,0,0,V,0,V,1,0,0,0,0,V,0,N,0,0,0,0,1,1,N,N,1,1,N,1,C,N,N,N,N,N,N,N,N,N,,0,104320,M,01/22/1957,743,61,3,1,0,C,C,C,0,9,0,1,2,3,3,12/19/18,1,09/19/2018,4,0,0,N,0,1,0,1,1,1,0,0,1,104320,1,5,0,1,0,,,,,1,0,0,0,,,,,,,,,,,,,,2,NULL,NULL,N,1,1,0,N,0,N,N,N,N,N,0,N,0,0,0,0,1,1,1,0,0,0,0,0,0,0,0,0,0,0,0,0,0,200,M,M,M,M,M,M,M,M,M,M,M,M,M,M,200,2,3,7,18,39,29,1,Los Angeles,Pacoima,2,,1,4,0,0,1,4
522964,517465,1,0,0,522964,39,1,0,0,1,12/23/18,0,0,0,0,2,0,Winter Shelter Program Pacoima SPA 2,Hope of the Valley Rescue Mission,1444,0,V,0,0,V,0,0,V,0,V,0,V,0,0,0,V,0,N,0,0,0,0,0,1,N,N,1,1,N,1,0,C,C,C,C,C,C,C,C,C,Not collected,0,104320,M,03/16/1979,477,39,3,1,0,1,0,2,1,1,0,6,2,4,13,12/23/18,1,09/09/2009,112,3,0,N,0,1,0,1,1,1,0,0,1,104320,1,4,1,0,0,1,0,0,0,1,0,0,0,1,0,1,0,0,0,0,0,1,0,0,0,0,2,NULL,NULL,N,N,N,0,N,N,N,N,N,N,N,N,N,N,N,N,N,0,0,N,N,N,N,N,N,N,N,N,N,N,N,N,N,N,M,M,M,M,M,M,M,M,M,M,M,M,M,M,M,M,2,3,7,18,39,29,1,Los Angeles,Pacoima,2,,1,4,0,0,1,3
519221,514317,1,0,0,519221,66,1,0,0,1,12/15/18,0,0,0,0,2,0,Winter Shelter Program Pacoima SPA 2,Hope of the Valley Rescue Mission,1444,0,V,0,0,V,0,0,V,1,0,0,V,0,0,0,V,0,N,0,0,0,0,1,1,N,N,0,N,3,7,0,N,N,N,N,N,N,N,N,N,,0,104320,M,03/04/1952,801,66,3,1,0,2,0,2,0,5,0,1,2,4,13,12/15/18,1,03/14/2014,58,3,1,N,0,1,0,1,1,1,0,0,1,104320,1,6,0,0,1,0,1,0,0,1,0,0,0,1,0,1,0,0,0,0,0,1,0,0,0,0,2,NULL,NULL,N,0,1,0,N,0,N,N,N,N,N,0,N,0,0,0,0,1,1,0,0,1,0,0,0,0,0,0,0,0,0,0,0,0,M,M,416,M,M,M,M,M,M,M,M,M,M,M,M,416,2,3,7,18,39,29,1,Los Angeles,Pacoima,2,,1,4,0,0,1,5
522247,516760,1,0,0,522247,50,1,0,0,1,12/20/18,0,0,0,0,2,0,Winter Shelter Program Pacoima SPA 2,Hope of the Valley Rescue Mission,1444,0,V,0,0,V,0,0,V,0,V,0,V,0,0,0,V,0,N,0,0,0,0,0,1,N,N,0,N,2,6,0,N,N,N,N,N,N,N,N,N,,0,104320,M,04/26/1968,608,50,3,1,0,2,1,1,0,21,0,2,1,1,1,12/20/18,1,06/16/2018,7,0,0,N,0,1,0,1,1,1,0,0,1,104320,1,4,1,0,0,0,1,0,0,1,0,0,0,0,1,0,0,0,0,0,,,,,,,2,NULL,NULL,N,N,N,0,N,N,N,N,N,N,N,N,N,N,N,N,N,0,0,N,N,N,N,N,N,N,N,N,N,N,N,N,N,N,M,M,M,M,M,M,M,M,M,M,M,M,M,M,M,M,2,3,7,18,39,29,1,Los Angeles,Pacoima,2,,1,4,0,0,1,3
524680,519355,1,0,0,524680,39,1,0,0,1,12/28/18,0,0,0,0,2,0,Winter Shelter Program Pacoima SPA 2,Hope of the Valley Rescue Mission,1444,0,V,0,0,V,0,0,V,0,V,0,V,0,0,0,V,0,N,0,0,0,0,0,1,N,N,0,N,1,5,0,N,N,N,N,N,N,N,N,N,,0,104320,M,08/29/1979,472,39,3,1,0,1,0,2,1,1,0,1,1,1,1,12/28/18,1,12/26/2018,1,0,0,N,0,1,0,1,1,1,0,0,1,104320,1,4,1,0,0,1,0,0,0,1,0,0,0,1,0,1,0,0,0,0,0,1,0,0,0,0,2,NULL,NULL,1,1,0,1,0,0,N,0,0,0,N,0,0,0,0,0,0,1,0,N,N,N,N,N,N,N,N,N,N,N,N,N,N,N,M,M,M,M,M,M,M,M,M,M,M,M,M,M,M,M,2,3,7,18,39,29,1,Los Angeles,Pacoima,2,,1,4,0,0,1,3
526358,521042,1,0,0,526358,27,1,0,0,1,12/12/18,0,0,0,0,2,0,Winter Shelter Program Pacoima SPA 2,Hope of the Valley Rescue Mission,1444,0,V,0,0,V,0,0,V,0,V,0,V,1,0,0,1,1,N,0,0,0,0,0,3,N,N,0,N,1,5,0,N,N,N,N,N,N,N,N,N,,0,104320,M,12/05/1991,324,27,3,1,0,2,0,1,1,1,0,6,1,1,13,12/12/18,1,01/01/2017,24,2,0,N,0,1,0,1,1,1,0,0,1,104320,1,4,1,0,0,0,1,0,0,0,0,1,0,1,1,0,0,0,0,0,1,0,0,0,0,0,2,NULL,NULL,1,1,0,1,0,0,N,0,0,0,N,0,0,0,0,0,0,1,1,0,0,0,0,0,0,0,0,1,0,0,0,0,0,0,M,M,M,M,M,M,M,M,221,M,M,M,M,M,M,221,2,3,7,18,39,29,1,Los Angeles,Pacoima,2,,1,4,0,0,1,3
522748,517236,1,0,0,522748,18,1,0,1,0,12/21/18,0,0,0,0,2,1,Winter Shelter Program Pacoima SPA 2,Hope of the Valley Rescue Mission,1444,0,V,0,0,V,0,0,V,0,V,0,V,0,0,0,V,0,N,0,0,0,0,0,1,N,N,0,N,1,5,0,N,N,N,N,N,N,N,N,N,,0,104320,M,09/22/2000,219,18,2,1,0,1,1,1,1,1,0,4,1,1,2,12/21/18,1,10/21/2018,3,0,0,N,0,1,0,1,1,1,0,0,1,104320,1,3,,,,1,0,0,0,1,0,0,0,0,1,0,0,0,0,0,,,,,,,2,NULL,NULL,1,1,0,1,0,0,N,0,0,0,N,0,0,0,0,0,0,1,1,0,0,0,0,0,0,0,0,1,0,0,0,0,0,0,M,M,M,M,M,M,M,M,221,M,M,M,M,M,M,221,2,3,7,18,39,29,1,Los Angeles,Pacoima,2,,1,4,0,1,0,2
518884,514109,1,0,0,518884,42,1,0,0,1,12/12/18,0,0,0,0,2,0,Winter Shelter Program Pacoima SPA 2,Hope of the Valley Rescue Mission,1444,0,V,0,0,V,0,0,V,0,V,0,V,1,0,0,4,1,N,0,0,0,0,0,1,N,N,0,N,2,6,0,N,N,N,N,N,N,N,N,N,,0,104320,M,12/25/1976,504,42,3,1,0,1,1,1,1,1,0,6,4,4,13,12/12/18,1,12/01/2017,13,3,0,N,0,1,0,1,1,1,0,0,1,104320,1,4,1,0,0,1,0,0,0,1,0,0,0,0,1,0,0,0,0,0,,,,,,,2,NULL,NULL,N,1,0,0,N,0,N,N,N,N,N,0,N,0,0,0,0,1,0,N,N,N,N,N,N,N,N,N,N,N,N,N,N,N,M,M,M,M,M,M,M,M,M,M,M,M,M,M,M,M,2,3,7,18,39,29,1,Los Angeles,Pacoima,2,,1,4,0,0,1,3
523238,517936,1,0,0,523238,27,1,0,0,1,12/25/18,0,0,0,0,2,0,Winter Shelter Program Pacoima SPA 2,Hope of the Valley Rescue Mission,1444,0,V,0,0,V,0,0,V,0,V,0,V,0,0,0,V,0,N,0,0,0,0,0,1,N,N,0,N,3,7,0,N,N,N,N,N,N,N,N,N,,0,104320,M,09/04/1991,327,27,3,1,0,1,1,1,1,1,0,4,1,1,1,12/25/18,1,11/22/2018,2,0,0,N,0,1,0,1,1,1,0,0,1,104320,1,4,1,0,0,1,0,0,0,1,0,0,0,0,1,0,0,0,0,0,,,,,,,2,NULL,NULL,1,1,0,1,0,0,N,0,0,0,N,0,0,0,0,0,0,1,1,0,0,0,0,0,0,0,0,1,0,0,0,0,0,0,M,M,M,M,M,M,M,M,221,M,M,M,M,M,M,221,2,3,7,18,39,29,1,Los Angeles,Pacoima,2,,1,4,0,0,1,3
521122,515685,1,0,0,521122,23,1,0,1,0,12/18/18,0,0,0,0,2,1,Winter Shelter Program Pacoima SPA 2,Hope of the Valley Rescue Mission,1444,0,V,0,0,V,0,0,V,1,1,0,V,0,0,0,V,0,0,1,0,1,0,1,1,N,N,1,2,N,2,0,N,N,N,N,N,N,N,N,N,,0,104320,M,02/21/1995,286,23,2,1,1,1,0,2,0,10,0,1,1,3,1,12/18/18,1,12/14/2018,1,0,0,N,0,1,0,1,1,1,0,0,1,104320,1,3,,,,1,0,0,0,1,0,0,0,1,0,1,0,0,0,0,0,1,0,0,0,0,2,NULL,NULL,N,1,0,0,N,0,N,N,N,N,N,0,N,0,0,0,0,1,1,1,0,0,0,0,0,0,0,0,0,0,0,0,0,0,2000,M,M,M,M,M,M,M,M,M,M,M,M,M,M,2000,2,3,7,18,39,29,1,Los Angeles,Pacoima,2,,1,4,0,1,0,2